Target
Androgen receptor
Ligand
BDBM50180823
Substrate
Meas. Tech.
ChEMBL_1584566 (CHEMBL3820557)
EC50
0.158489±n/a nM
Citation
 Handlon, ALSchaller, LTLeesnitzer, LMMerrihew, RVPoole, CUlrich, JCWilson, JWCadilla, RTurnbull, P Optimizing Ligand Efficiency of Selective Androgen Receptor Modulators (SARMs). ACS Med Chem Lett 7:83-8 (2016)  
Target
Name:
Androgen receptor
Synonyms:
ANDR_HUMAN Androgen Receptor Androgen receptor/Baculoviral IAP repeat-containing protein 2 Dihydrotestosterone receptor Nuclear receptor subfamily 3 group C member 4
Type:
Receptor
Mol. Mass.:
99185.27
Organism:
Homo sapiens (Human)
Description:
CHO cells were stably transfected with human AR gene.
Residue:
920
  
Inhibitor
Name:
BDBM50180823
Synonyms:
CHEMBL3819048
Type:
Small organic molecule
Emp. Form.:
C13H9F6NO
Mol. Mass.:
309.2071
SMILES:
OC(C1CC1)(c1ccc(C#N)c(c1)C(F)(F)F)C(F)(F)F
: