Target
Androgen receptor
Ligand
BDBM50180830
Substrate
Meas. Tech.
ChEMBL_1584566 (CHEMBL3820557)
EC50
0.251189±n/a nM
Citation
 Handlon, ALSchaller, LTLeesnitzer, LMMerrihew, RVPoole, CUlrich, JCWilson, JWCadilla, RTurnbull, P Optimizing Ligand Efficiency of Selective Androgen Receptor Modulators (SARMs). ACS Med Chem Lett 7:83-8 (2016)  
Target
Name:
Androgen receptor
Synonyms:
ANDR_HUMAN Androgen Receptor Androgen receptor/Baculoviral IAP repeat-containing protein 2 Dihydrotestosterone receptor Nuclear receptor subfamily 3 group C member 4
Type:
Receptor
Mol. Mass.:
99185.27
Organism:
Homo sapiens (Human)
Description:
CHO cells were stably transfected with human AR gene.
Residue:
920
  
Inhibitor
Name:
BDBM50180830
Synonyms:
CHEMBL3819303
Type:
Small organic molecule
Emp. Form.:
C14H13F6NO
Mol. Mass.:
325.2495
SMILES:
CC(C)C(O)(c1ccc(C#N)c(c1C)C(F)(F)F)C(F)(F)F
: