Target
Carbonic anhydrase 13
Ligand
BDBM50092612
Substrate
Meas. Tech.
ChEMBL_1586609 (CHEMBL3821964)
Ki
10630±n/a nM
Citation
 Mujumdar, PTeruya, KTonissen, KFVullo, DSupuran, CTPeat, TSPoulsen, SA An Unusual Natural Product Primary Sulfonamide: Synthesis, Carbonic Anhydrase Inhibition, and Protein X-ray Structures of Psammaplin C. J Med Chem 59:5462-70 (2016)  
Target
Name:
Carbonic anhydrase 13
Synonyms:
CA13 Carbonic anhydrase Carbonic anhydrase XIII (CA XIII)
Type:
Enzyme
Mol. Mass.:
29445.78
Organism:
Homo sapiens (Human)
Description:
Q8N1Q1
Residue:
262
  
Inhibitor
Name:
BDBM50092612
Synonyms:
CHEMBL3586274
Type:
Small organic molecule
Emp. Form.:
C11H14BrN3O5S
Mol. Mass.:
380.215
SMILES:
NS(=O)(=O)CCNC(=O)C(\Cc1ccc(O)c(Br)c1)=N\O
: