Target
Acetylcholinesterase
Ligand
BDBM50187215
Substrate
Meas. Tech.
ChEMBL_1589689 (CHEMBL3829844)
Kd
55500±n/a nM
Citation
 Karade, HNRaviraju, GAcharya, BNValiveti, AKBhalerao, UAcharya, J Synthesis and in vitro reactivation study of isonicotinamide derivatives of 2-(hydroxyimino)-N-(pyridin-3-yl)acetamide as reactivators of Sarin and VX inhibited human acetylcholinesterase (hAChE). Bioorg Med Chem 24:4171-4176 (2016)  
Target
Name:
Acetylcholinesterase
Synonyms:
ACES_HUMAN Acetylcholinesterase (AChE) | Acetylcholinesterase (human AChE)
Type:
Enzyme
Mol. Mass.:
67792.70
Organism:
Homo sapiens (Human)
Description:
P22303
Residue:
614
  
Inhibitor
Name:
BDBM50187215
Synonyms:
CHEMBL3828381
Type:
Small organic molecule
Emp. Form.:
C16H19Br2N5O3
Mol. Mass.:
489.162
SMILES:
[Br-].[Br-].NC(=O)c1cc[n+](CCC[n+]2cccc(NC(=O)\C=N/O)c2)cc1
: