Target
Acetylcholinesterase
Ligand
BDBM50333779
Substrate
Meas. Tech.
ChEMBL_1589694 (CHEMBL3829849)
IC50
910000±n/a nM
Citation
 Karade, HNRaviraju, GAcharya, BNValiveti, AKBhalerao, UAcharya, J Synthesis and in vitro reactivation study of isonicotinamide derivatives of 2-(hydroxyimino)-N-(pyridin-3-yl)acetamide as reactivators of Sarin and VX inhibited human acetylcholinesterase (hAChE). Bioorg Med Chem 24:4171-4176 (2016)  
Target
Name:
Acetylcholinesterase
Synonyms:
ACES_HUMAN Acetylcholinesterase (AChE) | Acetylcholinesterase (human AChE)
Type:
Enzyme
Mol. Mass.:
67792.70
Organism:
Homo sapiens (Human)
Description:
P22303
Residue:
614
  
Inhibitor
Name:
BDBM50333779
Synonyms:
1,3-Bis(4-(Hydroxyimino-methyl)-pyridinium)-2-oxapropane; dichloride(Toxogonin) 1,3-bis(4-hydroxyiminomethylpyridinium)-2-oxapropane dichloride 4-[(E)-(hydroxyimino)methyl]-1-[({4-[(E)-(hydroxyimino)methyl]pyridinium-1-yl}methoxy)methyl]pyridinium dichloride(toxogonin) CHEMBL291233 Toxogonin | obidoxime
Type:
Small organic molecule
Emp. Form.:
C14H16N4O3
Mol. Mass.:
288.3007
SMILES:
O=NCc1cc[n+](COC[n+]2ccc(CN=O)cc2)cc1
: