Target
Retinoic acid receptor RXR-alpha/RXR-beta/RXR-gamma
Ligand
BDBM28802
Substrate
Meas. Tech.
ChEMBL_1589948 (CHEMBL3830938)
EC50
>25000±n/a nM
Citation
 Shi, YLi, JKennedy, LJTao, SHernández, ASLai, ZChen, SWong, HZhu, JTrehan, ALim, NKZhang, HChen, BCLocke, KTO'Malley, KMZhang, LSrivastava, RAMiao, BMeyers, DSMonshizadegan, HSearch, DGrimm, DZhang, RHarrity, TKunselman, LKCap, MMuckelbauer, JChang, CKrystek, SRLi, YXHosagrahara, VZhang, LKadiyala, PXu, CBlanar, MAZahler, RMukherjee, RCheng, PTTino, JA Discovery and Preclinical Evaluation of BMS-711939, an Oxybenzylglycine Based PPARa Selective Agonist. ACS Med Chem Lett 7:590-4 (2016)  
Target
Name:
Retinoic acid receptor RXR-alpha/RXR-beta/RXR-gamma
Synonyms:
Retinoid X receptor
Type:
Mol. Mass.:
Description:
ASSAY_ID of ChEMBL is 1935812
Components:
This complex has 3 components.
Component 1
Name:
Retinoic acid receptor RXR-beta
Synonyms:
NR2B2 RXRB Retinoic acid receptor RXR-beta Retinoid receptor
Type:
PROTEIN
Mol. Mass.:
56932.89
Organism:
Homo sapiens (Human)
Description:
ChEMBL_39045
Residue:
533
  
Component 2
Name:
Retinoic acid receptor RXR-gamma
Synonyms:
NR2B3 RXRG Retinoic acid receptor RXR-gamma Retinoid X receptor gamma/retinoic acid receptor alpha
Type:
PROTEIN
Mol. Mass.:
50878.26
Organism:
Homo sapiens (Human)
Description:
ChEMBL_197216
Residue:
463
  
Component 3
Name:
Retinoic acid receptor RXR-alpha
Synonyms:
NR2B1 Nuclear receptor subfamily 4 group A member 2 RXRA Retinoic acid receptor RXR-alpha/gamma Retinoid receptor
Type:
PROTEIN
Mol. Mass.:
50820.38
Organism:
Homo sapiens (Human)
Description:
ChEMBL_1456363
Residue:
462
  
Inhibitor
Name:
BDBM28802
Synonyms:
2-{[(5-{[2-(4-chlorophenyl)-5-methyl-1,3-oxazol-4-yl]methoxy}-2-fluorophenyl)methyl](methoxycarbonyl)amino}acetic acid | BMS-711939
Type:
Small organic molecule
Emp. Form.:
C22H20ClFN2O6
Mol. Mass.:
462.855
SMILES:
COC(=O)N(CC(O)=O)Cc1cc(OCc2nc(oc2C)-c2ccc(Cl)cc2)ccc1F
: