Target
Dihydrofolate reductase
Ligand
BDBM50190621
Substrate
Meas. Tech.
ChEMBL_1589521 (CHEMBL3829095)
Ki
201±n/a nM
Citation
 Scocchera, EReeve, SMKeshipeddy, SLombardo, MNHajian, BSochia, AEAlverson, JBPriestley, NDAnderson, ACWright, DL Charged Nonclassical Antifolates with Activity Against Gram-Positive and Gram-Negative Pathogens. ACS Med Chem Lett 7:692-6 (2016)  
Target
Name:
Dihydrofolate reductase
Synonyms:
DHFR Dihydrofolate reductase (DHFR) | Tetrahydrofolate dehydrogenase
Type:
Enzyme
Mol. Mass.:
21453.99
Organism:
Homo sapiens (Human)
Description:
Recombinant human DHFR.
Residue:
187
  
Inhibitor
Name:
BDBM50190621
Synonyms:
CHEMBL3827532 | US10870625, Compound 15
Type:
Small organic molecule
Emp. Form.:
C23H22N4O3
Mol. Mass.:
402.4458
SMILES:
CCc1nc(N)nc(N)c1C#CCc1cc(ccc1OC)-c1ccc(cc1)C(O)=O
: