Target
Cyclin-dependent kinase 4/G1/S-specific cyclin-E1
Ligand
BDBM50193087
Substrate
Meas. Tech.
ChEMBL_1614399 (CHEMBL3856468)
IC50
1.000000±n/a nM
Citation
 Sonawane, YATaylor, MANapoleon, JVRana, SContreras, JINatarajan, A Cyclin Dependent Kinase 9 Inhibitors for Cancer Therapy. J Med Chem 59:8667-8684 (2016)  
Target
Name:
Cyclin-dependent kinase 4/G1/S-specific cyclin-E1
Synonyms:
CDK4/E1 | Cyclin-dependent kinase 4/G1/S-specific cyclin-E1
Type:
Protein
Mol. Mass.:
Description:
Components:
This complex has 2 components.
Component 1
Name:
Cyclin-dependent kinase 4
Synonyms:
CDK4 Cell division protein kinase 4 PSK-J3
Type:
Enzyme Subunit
Mol. Mass.:
33731.96
Organism:
Homo sapiens (Human)
Description:
P11802
Residue:
303
  
Component 2
Name:
G1/S-specific cyclin-E1
Synonyms:
CCNE CCNE1_HUMAN
Type:
Enzyme Subunit
Mol. Mass.:
47073.17
Organism:
Homo sapiens (Human)
Description:
Residue:
410
  
Inhibitor
Name:
BDBM50193087
Synonyms:
CHEMBL3897452
Type:
Small organic molecule
Emp. Form.:
C23H20F2N6
Mol. Mass.:
418.4419
SMILES:
CCNCc1cncc(c1C)-c1cccc2[nH]nc(-c3nc4c(F)cc(F)cc4[nH]3)c12
: