Target
Amine oxidase [flavin-containing] B
Ligand
BDBM29136
Substrate
Meas. Tech.
ChEMBL_1617982 (CHEMBL3860151)
IC50
7500±n/a nM
Citation
 Estrada, MHerrera-Arozamena, CPérez, CViña, DRomero, AMorales-García, JAPérez-Castillo, ARodríguez-Franco, MI New cinnamic - N-benzylpiperidine and cinnamic - N,N-dibenzyl(N-methyl)amine hybrids as Alzheimer-directed multitarget drugs with antioxidant, cholinergic, neuroprotective and neurogenic properties. Eur J Med Chem 121:376-386 (2016)  
Target
Name:
Amine oxidase [flavin-containing] B
Synonyms:
AOFB_HUMAN MAOB Monoamine oxidase type B (MAO B) Monoamine oxidase type B (MAOB)
Type:
Protein
Mol. Mass.:
58768.76
Organism:
Homo sapiens (Human)
Description:
P27338
Residue:
520
  
Inhibitor
Name:
BDBM29136
Synonyms:
CHEMBL92401 Iprazid | Iproniazid
Type:
Small organic molecule
Emp. Form.:
C9H13N3O
Mol. Mass.:
179.219
SMILES:
CC(C)NNC(=O)c1ccncc1
: