Target
Cholinesterase
Ligand
BDBM50195799
Substrate
Meas. Tech.
ChEMBL_1617979 (CHEMBL3860148)
IC50
260±n/a nM
Citation
 Estrada, MHerrera-Arozamena, CPérez, CViña, DRomero, AMorales-García, JAPérez-Castillo, ARodríguez-Franco, MI New cinnamic - N-benzylpiperidine and cinnamic - N,N-dibenzyl(N-methyl)amine hybrids as Alzheimer-directed multitarget drugs with antioxidant, cholinergic, neuroprotective and neurogenic properties. Eur J Med Chem 121:376-386 (2016)  
Target
Name:
Cholinesterase
Synonyms:
Acylcholine acylhydrolase Butyrylcholine esterase (BChE) Butyrylcholinesterase (BuChE) CHLE_HUMAN Cholinesterases Pseudocholinesterase
Type:
Homotetramer
Mol. Mass.:
68422.27
Organism:
Homo sapiens (Human)
Description:
P06276
Residue:
602
  
Inhibitor
Name:
BDBM50195799
Synonyms:
CHEMBL3965783
Type:
Small organic molecule
Emp. Form.:
C23H28N2O3
Mol. Mass.:
380.48
SMILES:
Oc1ccc(\C=C\C(=O)NCCC2CCN(Cc3ccccc3)CC2)c(O)c1
: