Target
Cholinesterase
Ligand
BDBM50195811
Substrate
Meas. Tech.
ChEMBL_1617979 (CHEMBL3860148)
IC50
5890±n/a nM
Citation
 Estrada, MHerrera-Arozamena, CPérez, CViña, DRomero, AMorales-García, JAPérez-Castillo, ARodríguez-Franco, MI New cinnamic - N-benzylpiperidine and cinnamic - N,N-dibenzyl(N-methyl)amine hybrids as Alzheimer-directed multitarget drugs with antioxidant, cholinergic, neuroprotective and neurogenic properties. Eur J Med Chem 121:376-386 (2016)  
Target
Name:
Cholinesterase
Synonyms:
Acylcholine acylhydrolase Butyrylcholine esterase (BChE) Butyrylcholinesterase (BuChE) CHLE_HUMAN Cholinesterases Pseudocholinesterase
Type:
Homotetramer
Mol. Mass.:
68422.27
Organism:
Homo sapiens (Human)
Description:
P06276
Residue:
602
  
Inhibitor
Name:
BDBM50195811
Synonyms:
CHEMBL3945872
Type:
Small organic molecule
Emp. Form.:
C25H26N2O3
Mol. Mass.:
402.4855
SMILES:
COc1cc(\C=C\C(=O)Nc2cccc(CN(C)Cc3ccccc3)c2)ccc1O
: