Target
Kinesin-like protein KIF20B
Ligand
BDBM50056904
Substrate
Meas. Tech.
ChEMBL_1617999 (CHEMBL3860168)
IC50
9900±n/a nM
Citation
 Talapatra, SKRath, OClayton, ETomasi, SKozielski, F Depsidones from Lichens as Natural Product Inhibitors of M-Phase Phosphoprotein 1, a Human Kinesin Required for Cytokinesis. J Nat Prod 79:1576-85 (2016)  
Target
Name:
Kinesin-like protein KIF20B
Synonyms:
CT90 KI20B_HUMAN KRMP1 Kinesin-like protein KIF20B M-phase phosphoprotein 1 MPP1 | Synonyms=KRMP1
Type:
PROTEIN
Mol. Mass.:
210600.28
Organism:
Homo sapiens (Human)
Description:
ChEMBL_104519
Residue:
1820
  
Inhibitor
Name:
BDBM50056904
Synonyms:
3,8-Dihydroxy-11-oxo-1-(2-oxo-heptyl)-6-pentyl-11H-dibenzo[b,e][1,4]dioxepine-7-carboxylic acid NSC-685589 cid_65751 | physodic acid
Type:
Small organic molecule
Emp. Form.:
C26H30O8
Mol. Mass.:
470.5116
SMILES:
CCCCCC(=O)Cc1cc(O)cc2Oc3c(OC(=O)c12)cc(O)c(C(O)=O)c3CCCCC
: