Target
Fatty acid-binding protein, adipocyte
Ligand
BDBM50197089
Substrate
Meas. Tech.
ChEMBL_1619186 (CHEMBL3861355)
Ki
20±n/a nM
Citation
 Kühne, HObst-Sander, UKuhn, BConte, ACeccarelli, SMNeidhart, WRudolph, MGOttaviani, GGasser, RSo, SSLi, SZhang, XGao, LMyers, M Design and synthesis of selective, dual fatty acid binding protein 4 and 5 inhibitors. Bioorg Med Chem Lett 26:5092-5097 (2016)  
Target
Name:
Fatty acid-binding protein, adipocyte
Synonyms:
A-FABP ALBP FABP4 Fatty acid binding protein adipocyte Fatty acid-binding protein 4 (FABP4)
Type:
Enzyme
Mol. Mass.:
14719.23
Organism:
Homo sapiens (Human)
Description:
P15090
Residue:
132
  
Inhibitor
Name:
BDBM50197089
Synonyms:
CHEMBL3889982
Type:
Small organic molecule
Emp. Form.:
C22H19ClN4O2
Mol. Mass.:
406.865
SMILES:
Clc1ccc2nc(N3CCCCC3)c(-c3n[nH]c(=O)o3)c(-c3ccccc3)c2c1
: