Target
Fatty acid-binding protein, adipocyte
Ligand
BDBM50197094
Substrate
Meas. Tech.
ChEMBL_1619186 (CHEMBL3861355)
Ki
22±n/a nM
Citation
 Kühne, HObst-Sander, UKuhn, BConte, ACeccarelli, SMNeidhart, WRudolph, MGOttaviani, GGasser, RSo, SSLi, SZhang, XGao, LMyers, M Design and synthesis of selective, dual fatty acid binding protein 4 and 5 inhibitors. Bioorg Med Chem Lett 26:5092-5097 (2016)  
Target
Name:
Fatty acid-binding protein, adipocyte
Synonyms:
A-FABP ALBP FABP4 Fatty acid binding protein adipocyte Fatty acid-binding protein 4 (FABP4)
Type:
Enzyme
Mol. Mass.:
14719.23
Organism:
Homo sapiens (Human)
Description:
P15090
Residue:
132
  
Inhibitor
Name:
BDBM50197094
Synonyms:
CHEMBL3941588
Type:
Small organic molecule
Emp. Form.:
C21H19ClN2O2
Mol. Mass.:
366.841
SMILES:
OC(=O)c1c(nc2ccc(Cl)cc2c1-c1ccccc1)N1CCCCC1
: