Target
Aurora kinase A
Ligand
BDBM50198154
Substrate
Meas. Tech.
ChEMBL_1620440 (CHEMBL3862723)
IC50
2300±n/a nM
Citation
 Kilchmann, FMarcaida, MJKotak, SSchick, TBoss, SDAwale, MGönczy, PReymond, JL Discovery of a Selective Aurora A Kinase Inhibitor by Virtual Screening. J Med Chem 59:7188-211 (2016)  
Target
Name:
Aurora kinase A
Synonyms:
AIK ARK-1 AURA AURKA_HUMAN Aurora 2 Aurora kinase A (AURKA) Aurora kinase A (Aurora-2) Aurora/IPL1-related kinase 1 Breast tumor-amplified kinase IAK1 STK15 GN Serine/threonine kinase 15 Serine/threonine-protein kinase 6 Serine/threonine-protein kinase aurora-A aurora-2 | hARK1
Type:
Serine/threonine-protein kinase
Mol. Mass.:
45830.98
Organism:
Homo sapiens (Human)
Description:
O14965
Residue:
403
  
Inhibitor
Name:
BDBM50198154
Synonyms:
CHEMBL3949078
Type:
Small organic molecule
Emp. Form.:
C14H10N4O2
Mol. Mass.:
266.2548
SMILES:
Oc1ccc2n(-c3nc4ccccc4[nH]3)c(=O)[nH]c2c1
: