Target
Carbonic anhydrase 2
Ligand
BDBM50335808
Substrate
Meas. Tech.
ChEMBL_1621727 (CHEMBL3864010)
IC50
5000000±n/a nM
Citation
 Malhotra, SKaranicolas, J When Does Chemical Elaboration Induce a Ligand To Change Its Binding Mode? J Med Chem 60:128-145 (2017)  
Target
Name:
Carbonic anhydrase 2
Synonyms:
CA-II CAC Carbonate dehydratase II Carbonic anhydrase 2 (CA-II) Carbonic anhydrase C Carbonic anhydrase II (CA-II) Carbonic anhydrase II (hCA II) | Carbonic anhydrase isoenzyme II (hCA II)
Type:
Enzyme
Mol. Mass.:
29250.71
Organism:
Homo sapiens (Human)
Description:
P00918
Residue:
260
  
Inhibitor
Name:
BDBM50335808
Synonyms:
2,5-Dihydroxybenzoate, VI CHEMBL1461 | gentisic acid
Type:
Small organic molecule
Emp. Form.:
C7H6O4
Mol. Mass.:
154.1201
SMILES:
OC(=O)c1cc(O)ccc1O
: