Target
Biotin--protein ligase
Ligand
BDBM50201186
Substrate
Meas. Tech.
ChEMBL_1623040 (CHEMBL3865392)
Ki
>16000±n/a nM
Citation
 Feng, JPaparella, ASTieu, WHeim, DClark, SHayes, ABooker, GWPolyak, SWAbell, AD New Series of BPL Inhibitors To Probe the Ribose-Binding Pocket of ACS Med Chem Lett 7:1068-1072 (2016)  
Target
Name:
Biotin--protein ligase
Synonyms:
BPL1_HUMAN Biotin--[acetyl-CoA-carboxylase] ligase Biotin--[methylmalonyl-CoA-carboxytransferase] ligase HCS Holocarboxylase synthetase
Type:
PROTEIN
Mol. Mass.:
80745.43
Organism:
Homo sapiens (Human)
Description:
ChEMBL_1475435
Residue:
726
  
Inhibitor
Name:
BDBM50201186
Synonyms:
CHEMBL3923732
Type:
Small organic molecule
Emp. Form.:
C20H27N5O2S
Mol. Mass.:
401.526
SMILES:
[H][C@]12CS[C@@H](CCCCCc3cn(Cc4ccccc4OC)nn3)[C@@]1([H])NC(=O)N2
: