Target
M-phase inducer phosphatase 2
Ligand
BDBM50201803
Substrate
Meas. Tech.
ChEMBL_1625486 (CHEMBL3867955)
IC50
5830000±n/a nM
Citation
 Meng, GZheng, MWang, MTong, JGe, WZhang, JZheng, ALi, JGao, LLi, J Design and synthesis of new potent PTP1B inhibitors with the skeleton of 2-substituted imino-3-substituted-5-heteroarylidene-1,3-thiazolidine-4-one: Part I. Eur J Med Chem 122:756-769 (2016)  
Target
Name:
M-phase inducer phosphatase 2
Synonyms:
CDC25B Dual specificity phosphatase (CDC25B) M-phase inducer phosphatase 2 (CDC25B) | MPIP2_HUMAN
Type:
Protein
Mol. Mass.:
64985.27
Organism:
Homo sapiens (Human)
Description:
Residue:
580
  
Inhibitor
Name:
BDBM50201803
Synonyms:
CHEMBL3908947
Type:
Small organic molecule
Emp. Form.:
C16H21N3O4S
Mol. Mass.:
351.421
SMILES:
CCOC(=O)c1c(C)[nH]c(\C=C2/S\C(=N\O)N(C(C)C)C2=O)c1C
: