Target
Matrix metalloproteinase-14
Ligand
BDBM50204002
Substrate
Meas. Tech.
ChEMBL_1625937 (CHEMBL3868406)
IC50
5.4±n/a nM
Citation
 Nara, HSato, KKaieda, AOki, HKuno, HSantou, TKanzaki, NTerauchi, JUchikawa, OKori, M Design, synthesis, and biological activity of novel, potent, and highly selective fused pyrimidine-2-carboxamide-4-one-based matrix metalloproteinase (MMP)-13 zinc-binding inhibitors. Bioorg Med Chem 24:6149-6165 (2016)  
Target
Name:
Matrix metalloproteinase-14
Synonyms:
MMP-14 MMP14 MT-MMP 1 MT1MMP Matrix Metalloproteinase-14 (MMP-14) Matrix metalloproteinase-14 Membrane-type matrix metalloproteinase 1 | Membrane-type-1 matrix metalloproteinase
Type:
Protein
Mol. Mass.:
65900.19
Organism:
Homo sapiens (Human)
Description:
P50281
Residue:
582
  
Inhibitor
Name:
BDBM50204002
Synonyms:
CHEMBL3889936
Type:
Small organic molecule
Emp. Form.:
C28H28N4O6S
Mol. Mass.:
548.61
SMILES:
CC(C)C(CS(=O)(=O)c1ccc(cc1)-c1cccc(CNC(=O)c2nc3ccccc3c(=O)[nH]2)c1)N(O)C=O
: