Target
Thrombin
Ligand
BDBM50206805
Substrate
Meas. Tech.
ChEMBL_1629275 (CHEMBL3871901)
IC50
88200±n/a nM
Citation
 Chen, DShi, JLiu, JZhang, XDeng, XYang, YCui, SZhu, QGong, GXu, Y Design, synthesis and antithrombotic evaluation of novel non-peptide thrombin inhibitors. Bioorg Med Chem 25:458-470 (2017)  
Target
Name:
Thrombin
Synonyms:
Thrombin
Type:
PROTEIN
Mol. Mass.:
27104.73
Organism:
Oryctolagus cuniculus
Description:
ChEMBL_104556
Residue:
235
  
Inhibitor
Name:
BDBM50206805
Synonyms:
CHEMBL3979276
Type:
Small organic molecule
Emp. Form.:
C31H38N6O3
Mol. Mass.:
542.6718
SMILES:
CCOC(=O)\N=C(/N)c1ccc(CC2NCCn3c2nc2cc(ccc32)C2(CCCC2)C(=O)N2CCCC2)cc1
: