Target
Indoleamine 2,3-dioxygenase 2
Ligand
BDBM50240612
Substrate
Meas. Tech.
ChEMBL_1629933 (CHEMBL3872639)
IC50
5000±n/a nM
Citation
 Li, JLi, YYang, DHu, NGuo, ZKuang, CYang, Q Establishment of a human indoleamine 2, 3-dioxygenase 2 (hIDO2) bioassay system and discovery of tryptanthrin derivatives as potent hIDO2 inhibitors. Eur J Med Chem 123:171-179 (2016)  
Target
Name:
Indoleamine 2,3-dioxygenase 2
Synonyms:
I23O2_HUMAN IDO2 Indoleamine 2,3-dioxygenase-like protein 1 | Indoleamine-pyrrole 2,3-dioxygenase-like protein 1
Type:
PROTEIN
Mol. Mass.:
47079.13
Organism:
Homo sapiens (Human)
Description:
ChEMBL_109909
Residue:
420
  
Inhibitor
Name:
BDBM50240612
Synonyms:
CHEMBL306946 Indolo[2,1-b]quinazoline-6,12-dione TRYPTANTHRIN | US10669273, Compound 5a
Type:
Small organic molecule
Emp. Form.:
C15H8N2O2
Mol. Mass.:
248.2362
SMILES:
O=C1c2ccccc2-n2c1nc1ccccc1c2=O
: