Target
Leukotriene A-4 hydrolase
Ligand
BDBM50210056
Substrate
Meas. Tech.
ChEBML_1634261
IC50
58290±n/a nM
Citation
 El-Naggar, MHMira, AAbdel Bar, FMShimizu, KAmer, MMBadria, FA Synthesis, docking, cytotoxicity, and LTA Bioorg Med Chem 25:1277-1285 (2017)  
Target
Name:
Leukotriene A-4 hydrolase
Synonyms:
LKHA4_HUMAN LTA4 Leukotriene A(4) hydrolase Leukotriene A4 hydrolase
Type:
Hydrolase; metalloprotease
Mol. Mass.:
69280.41
Organism:
Homo sapiens (Human)
Description:
Human recombinant LTA4H.
Residue:
611
  
Inhibitor
Name:
BDBM50210056
Synonyms:
6G [6]-gingerol | CHEMBL1950582
Type:
Small organic molecule
Emp. Form.:
C17H26O4
Mol. Mass.:
294.3859
SMILES:
CCCCCC(O)CC(=O)CCc1ccc(O)c(OC)c1
: