Target
Leukotriene A-4 hydrolase
Ligand
BDBM50210053
Substrate
Meas. Tech.
ChEBML_1634261
IC50
9310±n/a nM
Citation
 El-Naggar, MHMira, AAbdel Bar, FMShimizu, KAmer, MMBadria, FA Synthesis, docking, cytotoxicity, and LTA Bioorg Med Chem 25:1277-1285 (2017)  
Target
Name:
Leukotriene A-4 hydrolase
Synonyms:
LKHA4_HUMAN LTA4 Leukotriene A(4) hydrolase Leukotriene A4 hydrolase
Type:
Hydrolase; metalloprotease
Mol. Mass.:
69280.41
Organism:
Homo sapiens (Human)
Description:
Human recombinant LTA4H.
Residue:
611
  
Inhibitor
Name:
BDBM50210053
Synonyms:
CHEMBL3884753
Type:
Small organic molecule
Emp. Form.:
C19H26O4
Mol. Mass.:
318.4073
SMILES:
CCCCC\C=C\C(=O)CCc1ccc(OC(C)=O)c(OC)c1
: