Target
Leukotriene A-4 hydrolase
Ligand
BDBM50210060
Substrate
Meas. Tech.
ChEMBL_1634260 (CHEMBL3877052)
IC50
>100000±n/a nM
Citation
 El-Naggar, MHMira, AAbdel Bar, FMShimizu, KAmer, MMBadria, FA Synthesis, docking, cytotoxicity, and LTA Bioorg Med Chem 25:1277-1285 (2017)  
Target
Name:
Leukotriene A-4 hydrolase
Synonyms:
LKHA4_HUMAN LTA4 Leukotriene A(4) hydrolase Leukotriene A4 hydrolase
Type:
Hydrolase; metalloprotease
Mol. Mass.:
69280.41
Organism:
Homo sapiens (Human)
Description:
Human recombinant LTA4H.
Residue:
611
  
Inhibitor
Name:
BDBM50210060
Synonyms:
CHEMBL3885118
Type:
Small organic molecule
Emp. Form.:
C19H30O4
Mol. Mass.:
322.4391
SMILES:
CCCCCC(CC(=O)CCc1ccc(OC)c(OC)c1)OC
: