Target
Leukotriene A-4 hydrolase
Ligand
BDBM50210062
Substrate
Meas. Tech.
ChEMBL_1634260 (CHEMBL3877052)
IC50
22110±n/a nM
Citation
 El-Naggar, MHMira, AAbdel Bar, FMShimizu, KAmer, MMBadria, FA Synthesis, docking, cytotoxicity, and LTA Bioorg Med Chem 25:1277-1285 (2017)  
Target
Name:
Leukotriene A-4 hydrolase
Synonyms:
LKHA4_HUMAN LTA4 Leukotriene A(4) hydrolase Leukotriene A4 hydrolase
Type:
Hydrolase; metalloprotease
Mol. Mass.:
69280.41
Organism:
Homo sapiens (Human)
Description:
Human recombinant LTA4H.
Residue:
611
  
Inhibitor
Name:
BDBM50210062
Synonyms:
CHEMBL3884773
Type:
Small organic molecule
Emp. Form.:
C21H30O6
Mol. Mass.:
378.4593
SMILES:
CCCCCC(CC(=O)CCc1ccc(OC(C)=O)c(OC)c1)OC(C)=O
: