Target
Leukotriene A-4 hydrolase
Ligand
BDBM50210068
Substrate
Meas. Tech.
ChEMBL_1634261 (CHEMBL3877053)
IC50
15240±n/a nM
Citation
 El-Naggar, MHMira, AAbdel Bar, FMShimizu, KAmer, MMBadria, FA Synthesis, docking, cytotoxicity, and LTA Bioorg Med Chem 25:1277-1285 (2017)  
Target
Name:
Leukotriene A-4 hydrolase
Synonyms:
LKHA4_HUMAN LTA4 Leukotriene A(4) hydrolase Leukotriene A4 hydrolase
Type:
Hydrolase; metalloprotease
Mol. Mass.:
69280.41
Organism:
Homo sapiens (Human)
Description:
Human recombinant LTA4H.
Residue:
611
  
Inhibitor
Name:
BDBM50210068
Synonyms:
CHEMBL3883497
Type:
Small organic molecule
Emp. Form.:
C21H34O4
Mol. Mass.:
350.4923
SMILES:
CCCCCCCCCC(O)CC(=O)CCc1ccc(O)c(OC)c1
: