Target
Leukotriene A-4 hydrolase
Ligand
BDBM50240419
Substrate
Meas. Tech.
ChEMBL_1634261 (CHEMBL3877053)
IC50
24610±n/a nM
Citation
 El-Naggar, MHMira, AAbdel Bar, FMShimizu, KAmer, MMBadria, FA Synthesis, docking, cytotoxicity, and LTA Bioorg Med Chem 25:1277-1285 (2017)  
Target
Name:
Leukotriene A-4 hydrolase
Synonyms:
LKHA4_HUMAN LTA4 Leukotriene A(4) hydrolase Leukotriene A4 hydrolase
Type:
Hydrolase; metalloprotease
Mol. Mass.:
69280.41
Organism:
Homo sapiens (Human)
Description:
Human recombinant LTA4H.
Residue:
611
  
Inhibitor
Name:
BDBM50240419
Synonyms:
(E)-1-(4-Hydroxy-3-methoxy-phenyl)-dec-4-en-3-one CHEMBL25948 [6]-shogaol | trans-6-shogaol
Type:
Small organic molecule
Emp. Form.:
C17H24O3
Mol. Mass.:
276.3707
SMILES:
CCCCCC=CC(=O)CCc1ccc(O)c(OC)c1
: