Target
Voltage-dependent L-type calcium channel subunit alpha-1S
Ligand
BDBM50017723
Substrate
Meas. Tech.
ChEMBL_42922 (CHEMBL654565)
Kd
209±n/a nM
Comments
0.000000 20220115
Citation
  TBA Bioorg Med Chem Lett 2:1283-1288 (1992)   
Target
Name:
Voltage-dependent L-type calcium channel subunit alpha-1S
Synonyms:
CAC1S_RAT Cacn1 Cacnl1a3 Cchl1a3 Voltage-gated L-type calcium channel Voltage-gated calcium channel subunit alpha Cav1.1
Type:
PROTEIN
Mol. Mass.:
210392.58
Organism:
Rattus norvegicus
Description:
ChEMBL_92777
Residue:
1850
  
Inhibitor
Name:
BDBM50017723
Synonyms:
(3,3-Diphenyl-propyl)-(1-methyl-2-phenyl-ethyl)-amine Prenylamine | Prenylamine(3,3-Diphenyl-propyl)-(1-methyl-2-phenyl-ethyl)-amine
Type:
Small organic molecule
Emp. Form.:
C24H27N
Mol. Mass.:
329.4779
SMILES:
CC(Cc1ccccc1)NCCC(c1ccccc1)c1ccccc1
: