Target
UDP-N-acetylmuramoylalanine--D-glutamate ligase
Ligand
BDBM50221023
Substrate
Meas. Tech.
ChEMBL_212282 (CHEMBL819149)
IC50
49300±n/a nM
Citation
 Li, ZFrancisco, GDHu, WLabthavikul, PPetersen, PJSeverin, ASingh, GYang, YRasmussen, BALin, YISkotnicki, JSMansour, TS 2-Phenyl-5,6-dihydro-2H-thieno[3,2-c]pyrazol-3-ol derivatives as new inhibitors of bacterial cell wall biosynthesis. Bioorg Med Chem Lett 13:2591-4 (2003)  
Target
Name:
UDP-N-acetylmuramoylalanine--D-glutamate ligase
Synonyms:
MURD_STAAU murD
Type:
Protein
Mol. Mass.:
49837.61
Organism:
Staphylococcus aureus (Firmicutes)
Description:
S. aureus MurD
Residue:
449
  
Inhibitor
Name:
BDBM50221023
Synonyms:
CHEMBL84684
Type:
Small organic molecule
Emp. Form.:
C12H9N3OS
Mol. Mass.:
243.284
SMILES:
Oc1c2SCCc2nn1-c1ccc(cc1)C#N
: