Target
Amine oxidase [flavin-containing] A/B
Ligand
BDBM50026188
Substrate
Meas. Tech.
ChEMBL_124579 (CHEMBL734659)
IC50
400000±n/a nM
Citation
 McDonald, IALacoste, JMBey, PPalfreyman, MGZreika, M Enzyme-activated irreversible inhibitors of monoamine oxidase: phenylallylamine structure-activity relationships. J Med Chem 28:186-93 (1985)  
Target
Name:
Amine oxidase [flavin-containing] A/B
Synonyms:
Monoamine oxidase
Type:
Mol. Mass.:
Description:
ASSAY_ID of ChEMBL is 122635
Components:
This complex has 2 components.
Component 1
Name:
Amine oxidase [flavin-containing] B
Synonyms:
AOFB_RAT Amine oxidase [flavin-containing] B Monoamine Oxidase Type B (MAO-B) Monoamine oxidase B (MAO-B) Monoamine oxidase type B (MAOB) | Monoamine oxidase-B (MAO-B)
Type:
Enzyme
Mol. Mass.:
58469.65
Organism:
Rattus norvegicus (rat)
Description:
P19643
Residue:
520
  
Component 2
Name:
Amine oxidase [flavin-containing] A
Synonyms:
AOFA_RAT Amine oxidase [flavin-containing] A Monoamine Oxidase Type A (MAO-A) Monoamine oxidase A (MAO-A) Monoamine oxidase type A (MAOA)
Type:
Enzyme
Mol. Mass.:
59515.21
Organism:
Rattus norvegicus (rat)
Description:
Residue:
526
  
Inhibitor
Name:
BDBM50026188
Synonyms:
2-Phenyl-allylamine | CHEMBL89394
Type:
Small organic molecule
Emp. Form.:
C9H11N
Mol. Mass.:
133.1903
SMILES:
NCC(=C)c1ccccc1
: