Target
Beta-1/Beta-2/Beta-3 adrenergic receptor
Ligand
BDBM50226716
Substrate
Meas. Tech.
ChEMBL_38748 (CHEMBL651856)
Kd
1.6±n/a nM
Citation
 Pitha, JBuchowiecki, WMilecki, JKusiak, JW Affinity labels for beta-adrenoceptors: preparation and properties of alkylating beta-blockers derived from indole. J Med Chem 30:612-5 (1987)  
Target
Name:
Beta-1/Beta-2/Beta-3 adrenergic receptor
Synonyms:
Adrenergic receptor beta
Type:
Mol. Mass.:
Description:
ASSAY_ID of ChEMBL is 1340543
Components:
This complex has 3 components.
Component 1
Name:
Beta-1 adrenergic receptor
Synonyms:
ADRB1R, B1AR Adrb1 Adrenergic receptor beta Beta-1 adrenoreceptor adrenergic Beta1,2
Type:
Protein
Mol. Mass.:
50486.84
Organism:
Rattus norvegicus (Rat)
Description:
P18090
Residue:
466
  
Component 2
Name:
Beta-2 adrenergic receptor
Synonyms:
ADRB2_RAT Adrb2r | Adrenergic receptor beta
Type:
PROTEIN
Mol. Mass.:
46896.26
Organism:
Rattus norvegicus
Description:
ChEMBL_38603
Residue:
418
  
Component 3
Name:
Beta-3 adrenergic receptor
Synonyms:
ADRB3_RAT Adrb3r Beta-3 adrenergic receptor
Type:
PROTEIN
Mol. Mass.:
43161.83
Organism:
Rattus norvegicus
Description:
ChEMBL_1509452
Residue:
400
  
Inhibitor
Name:
BDBM50226716
Synonyms:
CHEMBL348176
Type:
Small organic molecule
Emp. Form.:
C24H33BrN4O3
Mol. Mass.:
505.448
SMILES:
CC(C)(NC(=O)CBr)C1CCC(C)(CC1)NCC(O)COc1cccc2[nH]c(cc12)C#N
: