Target
Cholecystokinin receptor type A/Gastrin/cholecystokinin type B receptor
Ligand
BDBM50226755
Substrate
Meas. Tech.
ChEMBL_49552 (CHEMBL664277)
Ki
2.0±n/a nM
Citation
 Horwell, DCBeeby, AClark, CRHughes, J Synthesis and binding affinities of analogues of cholecystokinin-(30-33) as probes for central nervous system cholecystokinin receptors. J Med Chem 30:729-32 (1987)  
Target
Name:
Cholecystokinin receptor type A/Gastrin/cholecystokinin type B receptor
Synonyms:
Cholecystokinin receptor
Type:
Mol. Mass.:
Description:
ASSAY_ID of ChEMBL is 49552
Components:
This complex has 2 components.
Component 1
Name:
Cholecystokinin receptor type A
Synonyms:
CCK-A receptor CCK1-R Cckar Cholecystokinin receptor Cholecystokinin-1 receptor
Type:
PROTEIN
Mol. Mass.:
48454.29
Organism:
Mus musculus
Description:
ChEMBL_40042
Residue:
436
  
Component 2
Name:
Gastrin/cholecystokinin type B receptor
Synonyms:
Cckbr Cholecystokinin receptor Gastrin/cholecystokinin type B receptor
Type:
Enzyme Catalytic Domain
Mol. Mass.:
49196.59
Organism:
MOUSE
Description:
Cholecystokinin A CCKBR MOUSE::P56481
Residue:
453
  
Inhibitor
Name:
BDBM50226755
Synonyms:
CHEMBL415630
Type:
Small organic molecule
Emp. Form.:
C45H57N9O13S3
Mol. Mass.:
1028.182
SMILES:
CSCC[C@H](NC(=O)[C@@H](N)Cc1ccc(OS(O)(=O)=O)cc1)C(=O)NCC(=O)N[C@@H](Cc1c[nH]c2ccccc12)C(=O)N[C@@H](CCSC)C(=O)N[C@@H](CC(O)=O)C(=O)N[C@@H](Cc1ccccc1)C(N)=O
: