Target
Poly [ADP-ribose] polymerase tankyrase-1
Ligand
BDBM50188594
Substrate
Meas. Tech.
ChEBML_1646308
IC50
95.5±n/a nM
Citation
 Thorsell, AGEkblad, TKarlberg, TLöw, MPinto, AFTrésaugues, LMoche, MCohen, MSSchüler, H Structural Basis for Potency and Promiscuity in Poly(ADP-ribose) Polymerase (PARP) and Tankyrase Inhibitors. J Med Chem 60:1262-1271 (2017)  
Target
Name:
Poly [ADP-ribose] polymerase tankyrase-1
Synonyms:
(ARTD5 or PARP5a) PARPL Poly [ADP-ribose] polymerase tankyrase-1 TINF1 TNKS1 Tankyrase 1 Tankyrase-1 Tankyrase-1 (TNKS1)
Type:
Enzyme
Mol. Mass.:
142058.03
Organism:
Homo sapiens (Human)
Description:
O95271
Residue:
1327
  
Inhibitor
Name:
BDBM50188594
Synonyms:
CHEBI:62878 | CHEMBL1086580
Type:
Small organic molecule
Emp. Form.:
C14H11F3N2OS
Mol. Mass.:
312.31
SMILES:
Oc1nc(nc2CCSCc12)-c1ccc(cc1)C(F)(F)F
: