Target
Poly [ADP-ribose] polymerase tankyrase-2
Ligand
BDBM50188594
Substrate
Meas. Tech.
ChEMBL_1646310 (CHEMBL3995366)
IC50
5.2±n/a nM
Citation
 Thorsell, AGEkblad, TKarlberg, TLöw, MPinto, AFTrésaugues, LMoche, MCohen, MSSchüler, H Structural Basis for Potency and Promiscuity in Poly(ADP-ribose) Polymerase (PARP) and Tankyrase Inhibitors. J Med Chem 60:1262-1271 (2017)  
Target
Name:
Poly [ADP-ribose] polymerase tankyrase-2
Synonyms:
(ARTD6 or PARP5b) Poly [ADP-ribose] polymerase tankyrase-2 TNKL TNKS2_HUMAN Tankyrase 2 Tankyrase-2 Tankyrase-2 (TNKS2)
Type:
Enzyme
Mol. Mass.:
126937.16
Organism:
Homo sapiens (Human)
Description:
Q9H2K2
Residue:
1166
  
Inhibitor
Name:
BDBM50188594
Synonyms:
CHEBI:62878 | CHEMBL1086580
Type:
Small organic molecule
Emp. Form.:
C14H11F3N2OS
Mol. Mass.:
312.31
SMILES:
Oc1nc(nc2CCSCc12)-c1ccc(cc1)C(F)(F)F
: