Target
Proteasome subunit beta type-10
Ligand
BDBM50232676
Substrate
Meas. Tech.
ChEMBL_1648458 (CHEMBL3997514)
IC50
>250000±n/a nM
Citation
 Johnson, HWBAnderl, JLBradley, EKBui, JJones, JArastu-Kapur, SKelly, LMLowe, EMoebius, DCMuchamuel, TKirk, CWang, ZMcMinn, D Discovery of Highly Selective Inhibitors of the Immunoproteasome Low Molecular Mass Polypeptide 2 (LMP2) Subunit. ACS Med Chem Lett 8:413-417 (2017)  
Target
Name:
Proteasome subunit beta type-10
Synonyms:
LMP10 MECL1 Multicatalytic endopeptidase complex subunit MECl-1 PSMB10 Proteasome subunit beta-2i
Type:
PROTEIN
Mol. Mass.:
28940.51
Organism:
Homo sapiens (Human)
Description:
ChEMBL_106197
Residue:
273
  
Inhibitor
Name:
BDBM50232676
Synonyms:
CHEMBL4101256
Type:
Small organic molecule
Emp. Form.:
C21H23N3O5
Mol. Mass.:
397.4244
SMILES:
C[C@H](NC(=O)c1cccc(=O)[nH]1)C(=O)N[C@@H](Cc1ccccc1)C(=O)[C@@]1(C)CO1
: