Target
Proteasome subunit beta type-1
Ligand
BDBM50232676
Substrate
Meas. Tech.
ChEMBL_1648455 (CHEMBL3997511)
IC50
>222000±n/a nM
Citation
 Johnson, HWBAnderl, JLBradley, EKBui, JJones, JArastu-Kapur, SKelly, LMLowe, EMoebius, DCMuchamuel, TKirk, CWang, ZMcMinn, D Discovery of Highly Selective Inhibitors of the Immunoproteasome Low Molecular Mass Polypeptide 2 (LMP2) Subunit. ACS Med Chem Lett 8:413-417 (2017)  
Target
Name:
Proteasome subunit beta type-1
Synonyms:
PSB1_HUMAN PSMB1 Proteasome subunit beta type-1/beta type-5
Type:
PROTEIN
Mol. Mass.:
26493.62
Organism:
Homo sapiens (Human)
Description:
ChEMBL_1366691
Residue:
241
  
Inhibitor
Name:
BDBM50232676
Synonyms:
CHEMBL4101256
Type:
Small organic molecule
Emp. Form.:
C21H23N3O5
Mol. Mass.:
397.4244
SMILES:
C[C@H](NC(=O)c1cccc(=O)[nH]1)C(=O)N[C@@H](Cc1ccccc1)C(=O)[C@@]1(C)CO1
: