Target
D(1A) dopamine receptor
Ligand
BDBM50424077
Substrate
Meas. Tech.
ChEMBL_1650509 (CHEMBL3999643)
Ki
153±n/a nM
Citation
 Lee, DYWLiu, JZhang, SHuang, PLiu-Chen, LY Asymmetric total synthesis of tetrahydroprotoberberine derivatives and evaluation of their binding affinities at dopamine receptors. Bioorg Med Chem Lett 27:1437-1440 (2017)  
Target
Name:
D(1A) dopamine receptor
Synonyms:
DA D1 receptor DRD1 Dopamine D1 receptor Dopamine D1A
Type:
Enzyme
Mol. Mass.:
49303.43
Organism:
Homo sapiens (Human)
Description:
P21728
Residue:
446
  
Inhibitor
Name:
BDBM50424077
Synonyms:
(-)-Tetrahydropalmatine TETRAHYDROPALMATINE
Type:
Small organic molecule
Emp. Form.:
C21H25NO4
Mol. Mass.:
355.4275
SMILES:
COc1cc2CCN3Cc4c(C[C@H]3c2cc1OC)ccc(OC)c4OC
: