Target
Intestinal-type alkaline phosphatase
Ligand
BDBM50234702
Substrate
Meas. Tech.
ChEMBL_1653677 (CHEMBL4003043)
IC50
2470±n/a nM
Citation
 Miliutina, MEjaz, SAKhan, SUIaroshenko, VOVillinger, AIqbal, JLanger, P Synthesis, alkaline phosphatase inhibition studies and molecular docking of novel derivatives of 4-quinolones. Eur J Med Chem 126:408-420 (2017)  
Target
Name:
Intestinal-type alkaline phosphatase
Synonyms:
ALPI Intestinal alkaline phosphatase (IAP) PPBI_BOVIN
Type:
Protein
Mol. Mass.:
57094.82
Organism:
Bos taurus (Cattle)
Description:
P19111
Residue:
533
  
Inhibitor
Name:
BDBM50234702
Synonyms:
CHEMBL4066927
Type:
Small organic molecule
Emp. Form.:
C24H19BrN2O3
Mol. Mass.:
463.323
SMILES:
CC(c1ccccc1)n1c(-c2ccc(C)cc2)c(Br)c(=O)c2cc(ccc12)[N+]([O-])=O
: