Target
Intestinal-type alkaline phosphatase
Ligand
BDBM50237966
Substrate
Meas. Tech.
ChEMBL_1662570 (CHEMBL4012251)
IC50
3060±n/a nM
Citation
 Salar, UKhan, KMIqbal, JEjaz, SAHameed, AAl-Rashida, MPerveen, STahir, MN Coumarin sulfonates: New alkaline phosphatase inhibitors; in vitro and in silico studies. Eur J Med Chem 131:29-47 (2017)  
Target
Name:
Intestinal-type alkaline phosphatase
Synonyms:
ALPI Intestinal alkaline phosphatase | PPBI_HUMAN
Type:
PROTEIN
Mol. Mass.:
56804.94
Organism:
Homo sapiens (Human)
Description:
ChEMBL_1278525
Residue:
528
  
Inhibitor
Name:
BDBM50237966
Synonyms:
CHEMBL4078377
Type:
Small organic molecule
Emp. Form.:
C24H27NO7S
Mol. Mass.:
473.539
SMILES:
CCCCCCCCc1ccc(cc1)S(=O)(=O)Oc1ccc2c(C)cc(=O)oc2c1[N+]([O-])=O
: