Target
Intestinal-type alkaline phosphatase
Ligand
BDBM50237965
Substrate
Meas. Tech.
ChEMBL_1662570 (CHEMBL4012251)
IC50
4060±n/a nM
Citation
 Salar, UKhan, KMIqbal, JEjaz, SAHameed, AAl-Rashida, MPerveen, STahir, MN Coumarin sulfonates: New alkaline phosphatase inhibitors; in vitro and in silico studies. Eur J Med Chem 131:29-47 (2017)  
Target
Name:
Intestinal-type alkaline phosphatase
Synonyms:
ALPI Intestinal alkaline phosphatase | PPBI_HUMAN
Type:
PROTEIN
Mol. Mass.:
56804.94
Organism:
Homo sapiens (Human)
Description:
ChEMBL_1278525
Residue:
528
  
Inhibitor
Name:
BDBM50237965
Synonyms:
CHEMBL4068298
Type:
Small organic molecule
Emp. Form.:
C16H9Cl2NO7S
Mol. Mass.:
430.216
SMILES:
Cc1c(Cl)c(=O)oc2cc(OS(=O)(=O)c3ccc(Cl)c(c3)[N+]([O-])=O)ccc12
: