Target
Alkaline phosphatase, tissue-nonspecific isozyme
Ligand
BDBM50237941
Substrate
Meas. Tech.
ChEMBL_1662569 (CHEMBL4012250)
IC50
2510±n/a nM
Citation
 Salar, UKhan, KMIqbal, JEjaz, SAHameed, AAl-Rashida, MPerveen, STahir, MN Coumarin sulfonates: New alkaline phosphatase inhibitors; in vitro and in silico studies. Eur J Med Chem 131:29-47 (2017)  
Target
Name:
Alkaline phosphatase, tissue-nonspecific isozyme
Synonyms:
ALPL tissue-nonspecific alkaline phosphatase precursor
Type:
PROTEIN
Mol. Mass.:
57306.17
Organism:
Homo sapiens (Human)
Description:
ChEMBL_1448917
Residue:
524
  
Inhibitor
Name:
BDBM50237941
Synonyms:
CHEMBL4073985
Type:
Small organic molecule
Emp. Form.:
C11H9ClO5S
Mol. Mass.:
288.704
SMILES:
Cc1c(Cl)c(=O)oc2cc(OS(C)(=O)=O)ccc12
: