Target
Intestinal-type alkaline phosphatase
Ligand
BDBM50237947
Substrate
Meas. Tech.
ChEMBL_1662570 (CHEMBL4012251)
IC50
3910±n/a nM
Citation
 Salar, UKhan, KMIqbal, JEjaz, SAHameed, AAl-Rashida, MPerveen, STahir, MN Coumarin sulfonates: New alkaline phosphatase inhibitors; in vitro and in silico studies. Eur J Med Chem 131:29-47 (2017)  
Target
Name:
Intestinal-type alkaline phosphatase
Synonyms:
ALPI Intestinal alkaline phosphatase | PPBI_HUMAN
Type:
PROTEIN
Mol. Mass.:
56804.94
Organism:
Homo sapiens (Human)
Description:
ChEMBL_1278525
Residue:
528
  
Inhibitor
Name:
BDBM50237947
Synonyms:
CHEMBL4083749
Type:
Small organic molecule
Emp. Form.:
C17H13NO7S
Mol. Mass.:
375.353
SMILES:
Cc1ccc(cc1S(=O)(=O)Oc1ccc2c(C)cc(=O)oc2c1)[N+]([O-])=O
: