Target
Alkaline phosphatase, tissue-nonspecific isozyme
Ligand
BDBM50237931
Substrate
Meas. Tech.
ChEMBL_1662569 (CHEMBL4012250)
IC50
920±n/a nM
Citation
 Salar, UKhan, KMIqbal, JEjaz, SAHameed, AAl-Rashida, MPerveen, STahir, MN Coumarin sulfonates: New alkaline phosphatase inhibitors; in vitro and in silico studies. Eur J Med Chem 131:29-47 (2017)  
Target
Name:
Alkaline phosphatase, tissue-nonspecific isozyme
Synonyms:
ALPL tissue-nonspecific alkaline phosphatase precursor
Type:
PROTEIN
Mol. Mass.:
57306.17
Organism:
Homo sapiens (Human)
Description:
ChEMBL_1448917
Residue:
524
  
Inhibitor
Name:
BDBM50237931
Synonyms:
CHEMBL4095459
Type:
Small organic molecule
Emp. Form.:
C26H40O8S2
Mol. Mass.:
544.721
SMILES:
CCCCCCCCS(=O)(=O)Oc1ccc2c(C)cc(=O)oc2c1OS(=O)(=O)CCCCCCCC
: