Target
Intestinal-type alkaline phosphatase
Ligand
BDBM50237913
Substrate
Meas. Tech.
ChEMBL_1662570 (CHEMBL4012251)
IC50
5160±n/a nM
Citation
 Salar, UKhan, KMIqbal, JEjaz, SAHameed, AAl-Rashida, MPerveen, STahir, MN Coumarin sulfonates: New alkaline phosphatase inhibitors; in vitro and in silico studies. Eur J Med Chem 131:29-47 (2017)  
Target
Name:
Intestinal-type alkaline phosphatase
Synonyms:
ALPI Intestinal alkaline phosphatase | PPBI_HUMAN
Type:
PROTEIN
Mol. Mass.:
56804.94
Organism:
Homo sapiens (Human)
Description:
ChEMBL_1278525
Residue:
528
  
Inhibitor
Name:
BDBM50237913
Synonyms:
CHEMBL4091160
Type:
Small organic molecule
Emp. Form.:
C17H10N2O7S
Mol. Mass.:
386.335
SMILES:
Cc1c(C#N)c(=O)oc2cc(OS(=O)(=O)c3cccc(c3)[N+]([O-])=O)ccc12
: