Target
Intestinal-type alkaline phosphatase
Ligand
BDBM50237943
Substrate
Meas. Tech.
ChEMBL_1662570 (CHEMBL4012251)
IC50
4650±n/a nM
Citation
 Salar, UKhan, KMIqbal, JEjaz, SAHameed, AAl-Rashida, MPerveen, STahir, MN Coumarin sulfonates: New alkaline phosphatase inhibitors; in vitro and in silico studies. Eur J Med Chem 131:29-47 (2017)  
Target
Name:
Intestinal-type alkaline phosphatase
Synonyms:
ALPI Intestinal alkaline phosphatase | PPBI_HUMAN
Type:
PROTEIN
Mol. Mass.:
56804.94
Organism:
Homo sapiens (Human)
Description:
ChEMBL_1278525
Residue:
528
  
Inhibitor
Name:
BDBM50237943
Synonyms:
CHEMBL4086241
Type:
Small organic molecule
Emp. Form.:
C16H9ClN2O9S
Mol. Mass.:
440.769
SMILES:
Cc1cc(=O)oc2c(c(OS(=O)(=O)c3ccc(Cl)c(c3)[N+]([O-])=O)ccc12)[N+]([O-])=O
: