Target
Intestinal-type alkaline phosphatase
Ligand
BDBM50237924
Substrate
Meas. Tech.
ChEMBL_1662570 (CHEMBL4012251)
IC50
3120±n/a nM
Citation
 Salar, UKhan, KMIqbal, JEjaz, SAHameed, AAl-Rashida, MPerveen, STahir, MN Coumarin sulfonates: New alkaline phosphatase inhibitors; in vitro and in silico studies. Eur J Med Chem 131:29-47 (2017)  
Target
Name:
Intestinal-type alkaline phosphatase
Synonyms:
ALPI Intestinal alkaline phosphatase | PPBI_HUMAN
Type:
PROTEIN
Mol. Mass.:
56804.94
Organism:
Homo sapiens (Human)
Description:
ChEMBL_1278525
Residue:
528
  
Inhibitor
Name:
BDBM50237924
Synonyms:
CHEMBL4102277
Type:
Small organic molecule
Emp. Form.:
C18H23ClO5S
Mol. Mass.:
386.89
SMILES:
CCCCCCCCS(=O)(=O)Oc1ccc2c(C)c(Cl)c(=O)oc2c1
: