Target
Protein mono-ADP-ribosyltransferase PARP14
Ligand
BDBM50188594
Substrate
Meas. Tech.
ChEMBL_1663208 (CHEMBL4012889)
IC50
<5012±n/a nM
Citation
 Thomson, DWWagner, AJBantscheff, MBenson, REDittus, LDuempelfeld, BDrewes, GKrause, JMoore, JTMueller, KPoeckel, DRau, CSalzer, EShewchuk, LHopf, CEmery, JGMuelbaier, M Discovery of a Highly Selective Tankyrase Inhibitor Displaying Growth Inhibition Effects against a Diverse Range of Tumor Derived Cell Lines. J Med Chem 60:5455-5471 (2017)  
Target
Name:
Protein mono-ADP-ribosyltransferase PARP14
Synonyms:
(ARTD8 or PARP14) 2.4.2.- ADP-ribosyltransferase diphtheria toxin-like 8 B aggressive lymphoma protein 2 BAL2  KIAA1268 KIAA1268 GN PARP-14 Poly [ADP-ribose] polymerase 14 | Synonyms=BAL2
Type:
Mol. Mass.:
202812.41
Organism:
Homo sapiens (Human)
Description:
Q460N5
Residue:
1801
  
Inhibitor
Name:
BDBM50188594
Synonyms:
CHEBI:62878 | CHEMBL1086580
Type:
Small organic molecule
Emp. Form.:
C14H11F3N2OS
Mol. Mass.:
312.31
SMILES:
Oc1nc(nc2CCSCc12)-c1ccc(cc1)C(F)(F)F
: