Target
Protein mono-ADP-ribosyltransferase PARP16
Ligand
BDBM50188594
Substrate
Meas. Tech.
ChEMBL_1663209 (CHEMBL4012890)
IC50
<5012±n/a nM
Citation
 Thomson, DWWagner, AJBantscheff, MBenson, REDittus, LDuempelfeld, BDrewes, GKrause, JMoore, JTMueller, KPoeckel, DRau, CSalzer, EShewchuk, LHopf, CEmery, JGMuelbaier, M Discovery of a Highly Selective Tankyrase Inhibitor Displaying Growth Inhibition Effects against a Diverse Range of Tumor Derived Cell Lines. J Med Chem 60:5455-5471 (2017)  
Target
Name:
Protein mono-ADP-ribosyltransferase PARP16
Synonyms:
2.4.2.30 ARTD15 Mono [ADP-ribose] polymerase PARP16 PARP-16 Poly [ADP-ribose] polymerase 16 | Synonyms=ARTD15
Type:
PROTEIN
Mol. Mass.:
36398.93
Organism:
Homo sapiens (Human)
Description:
ChEMBL_117586
Residue:
322
  
Inhibitor
Name:
BDBM50188594
Synonyms:
CHEBI:62878 | CHEMBL1086580
Type:
Small organic molecule
Emp. Form.:
C14H11F3N2OS
Mol. Mass.:
312.31
SMILES:
Oc1nc(nc2CCSCc12)-c1ccc(cc1)C(F)(F)F
: