Target
Death-associated protein kinase 3
Ligand
BDBM50238990
Substrate
Meas. Tech.
ChEMBL_1664714 (CHEMBL4014510)
IC50
18880±n/a nM
Citation
 Wang, SXu, LLu, YTLiu, YFHan, BLiu, TTang, JLi, JWu, JLi, JYYu, LFYang, F Discovery of benzofuran-3(2H)-one derivatives as novel DRAK2 inhibitors that protect islet?-cells from apoptosis. Eur J Med Chem 130:195-208 (2017)  
Target
Name:
Death-associated protein kinase 3
Synonyms:
DAP kinase 3 DAPK3 ZIP-kinase | ZIPK
Type:
PROTEIN
Mol. Mass.:
52537.07
Organism:
Homo sapiens (Human)
Description:
ChEMBL_586564
Residue:
454
  
Inhibitor
Name:
BDBM50238990
Synonyms:
CHEMBL4105195
Type:
Small organic molecule
Emp. Form.:
C18H16O5
Mol. Mass.:
312.3166
SMILES:
CCOc1cc(\C=C2/Oc3ccc(OC)cc3C2=O)ccc1O
: