Target
Death-associated protein kinase 3
Ligand
BDBM50580
Substrate
Meas. Tech.
ChEMBL_1664714 (CHEMBL4014510)
IC50
2330±n/a nM
Citation
 Wang, SXu, LLu, YTLiu, YFHan, BLiu, TTang, JLi, JWu, JLi, JYYu, LFYang, F Discovery of benzofuran-3(2H)-one derivatives as novel DRAK2 inhibitors that protect islet?-cells from apoptosis. Eur J Med Chem 130:195-208 (2017)  
Target
Name:
Death-associated protein kinase 3
Synonyms:
DAP kinase 3 DAPK3 ZIP-kinase | ZIPK
Type:
PROTEIN
Mol. Mass.:
52537.07
Organism:
Homo sapiens (Human)
Description:
ChEMBL_586564
Residue:
454
  
Inhibitor
Name:
BDBM50580
Synonyms:
(2Z)-2-(3,4-dihydroxybenzylidene)-6-hydroxy-coumaran-3-one (2Z)-2-[(3,4-dihydroxyphenyl)methylidene]-6-hydroxy-3-benzofuranone MLS000863576 SULFURETIN | cid_5281295
Type:
Small organic molecule
Emp. Form.:
C15H10O5
Mol. Mass.:
270.2369
SMILES:
Oc1ccc2C(=O)\C(Oc2c1)=C\c1ccc(O)c(O)c1
: